Reaction Details
TargetDual specificity protein kinase TTK
LigandBDBM241248
Substrate/Competitorn/a
Meas. Tech.ChEBML_1581301
IC50 250±n/a nM
Citation Innocenti, PWoodward, HLSolanki, SNaud, SWestwood, IMCronin, NHayes, ARoberts, JHenley, ATBaker, RFaisal, AMak, GWBox, GValenti, MDe Haven Brandon, AO'Fee, LSaville, HSchmitt, JMatijssen, BBurke, Rvan Montfort, RLRaynaud, FIEccles, SALinardopoulos, SBlagg, JHoelder, S Rapid Discovery of Pyrido[3,4-d]pyrimidine Inhibitors of Monopolar Spindle Kinase 1 (MPS1) Using a Structure-Based Hybridization Approach. J Med Chem59:3671-88 (2016) 
 
Dual specificity protein kinase TTK
Name:Dual specificity protein kinase TTK
Type:Protein
Mol. Mass.:97086.79
Organism:Homo sapiens (Human)
Description:P33981
Residue:857
BDBM241248
NameBDBM241248
Synonyms:US11046688, Example 90 | US9409907, 90
TypeSmall organic molecule
Emp. Form.C24H26N6OS
Mol. Mass.446.568
SMILESCOc1cc(ccc1Nc1ncc2ccnc(SC3CCCCC3)c2n1)-c1cnn(C)c1