Reaction Details
TargetCyclin-A2/Cyclin-dependent kinase 2
LigandBDBM241195
Substrate/Competitorn/a
Meas. Tech.ChEMBL_1581302 (CHEMBL3811379)
IC50 2830±n/a nM
Citation Innocenti, PWoodward, HLSolanki, SNaud, SWestwood, IMCronin, NHayes, ARoberts, JHenley, ATBaker, RFaisal, AMak, GWBox, GValenti, MDe Haven Brandon, AO'Fee, LSaville, HSchmitt, JMatijssen, BBurke, Rvan Montfort, RLRaynaud, FIEccles, SALinardopoulos, SBlagg, JHoelder, S Rapid Discovery of Pyrido[3,4-d]pyrimidine Inhibitors of Monopolar Spindle Kinase 1 (MPS1) Using a Structure-Based Hybridization Approach. J Med Chem59:3671-88 (2016) 
 
Cyclin-A2/Cyclin-dependent kinase 2
Name:Cyclin-A2/Cyclin-dependent kinase 2
Type:Protein Complex
Mol. Mass.:n/a
Description:Cdk2/Cyclin A kinase was purified from insect cells coinfected with Cyclin A/Cdk2 baculovirus.
Components:This complex has 2 components.
Component 1
Name:Cyclin-dependent kinase 2
Synonyms:CDK2 CDK2_HUMAN Cell division protein kinase 2 Protein cereblon/Cyclin-dependent kinase 2 | p33 protein kinase
Type:Enzyme Subunit
Mol. Mass.:33938.17
Organism:Homo sapiens (Human)
Description:P24941
Residue:298
Component 2
Name:Cyclin-A2
Synonyms:CCN1 CCNA1 CCNA2_HUMAN Cyclin-A
Type:Enzyme Subunit
Mol. Mass.:48550.19
Organism:Homo sapiens (Human)
Description:P20248
Residue:432
BDBM241195
NameBDBM241195
Synonyms:US10479788, Example 37 US9409907, 37
TypeSmall organic molecule
Emp. Form.C22H23N7O
Mol. Mass.401.4643
SMILESCOc1cc(ccc1Nc1ncc2ccnc(N3CCCC3)c2n1)-c1cnn(C)c1