Reaction Details
TargetDNA topoisomerase 4 subunit B
LigandBDBM50173878
Substrate/Competitorn/a
Meas. Tech.ChEMBL_1580966 (CHEMBL3812634)
IC50 746±n/a nM
Citation Cross, JBZhang, JYang, QMesleh, MFRomero, JAWang, BBevan, DPoutsiaka, KMEpie, FMoy, TDaniel, AShotwell, JChamberlain, BCarter, NAndersen, OBarker, JRyan, MDMetcalf, CASilverman, JNguyen, KLippa, BDolle, RE Discovery of Pyrazolopyridones as a Novel Class of Gyrase B Inhibitors Using Structure Guided Design. ACS Med Chem Lett7:374-8 (2016) 
 
DNA topoisomerase 4 subunit B
Name:DNA topoisomerase 4 subunit B
Type:Enzyme
Mol. Mass.:74365.92
Organism:Staphylococcus aureus
Description:Q2FYS5
Residue:663
BDBM50173878
NameBDBM50173878
Synonyms:CHEMBL3809316
TypeSmall organic molecule
Emp. Form.C16H13N5OS
Mol. Mass.323.372
SMILESCCn1c2[nH]nc(-c3cnc(s3)-c3cccnc3)c2ccc1=O