Reaction Details
TargetDNA gyrase subunit B
LigandBDBM50173889
Substrate/Competitorn/a
Meas. Tech.ChEMBL_1580968 (CHEMBL3812636)
IC50 4.0±n/a nM
Citation Cross, JBZhang, JYang, QMesleh, MFRomero, JAWang, BBevan, DPoutsiaka, KMEpie, FMoy, TDaniel, AShotwell, JChamberlain, BCarter, NAndersen, OBarker, JRyan, MDMetcalf, CASilverman, JNguyen, KLippa, BDolle, RE Discovery of Pyrazolopyridones as a Novel Class of Gyrase B Inhibitors Using Structure Guided Design. ACS Med Chem Lett7:374-8 (2016) 
 
DNA gyrase subunit B
Name:DNA gyrase subunit B
Type:Enzyme Subunit
Mol. Mass.:72530.91
Organism:Staphylococcus aureus
Description:n/a
Residue:644
BDBM50173889
NameBDBM50173889
Synonyms:CHEMBL3809400
TypeSmall organic molecule
Emp. Form.C17H13N5OS
Mol. Mass.335.383
SMILESC=CCn1c2[nH]nc(-c3cnc(s3)-c3cccnc3)c2ccc1=O