Reaction Details
TargetBranched-chain-amino-acid aminotransferase, mitochondrial
LigandBDBM50173927
Substrate/Competitorn/a
Meas. Tech.ChEMBL_1580973 (CHEMBL3812805)
IC50 50±n/a nM
Citation Deng, HZhou, JSundersingh, FMesser, JASomers, DOAjakane, MArico-Muendel, CCBeljean, ABelyanskaya, SLBingham, RBlazensky, EBoullay, ABBoursier, EChai, JCarter, PChung, CWDaugan, ADing, YHerry, KHobbs, CHumphries, EKollmann, CNguyen, VLNicodeme, ESmith, SEDodic, NAncellin, N Discovery and Optimization of Potent, Selective, and in Vivo Efficacious 2-Aryl Benzimidazole BCATm Inhibitors. ACS Med Chem Lett7:379-84 (2016) 
 
Branched-chain-amino-acid aminotransferase, mitochondrial
Name:Branched-chain-amino-acid aminotransferase, mitochondrial
Type:PROTEIN
Mol. Mass.:44297.81
Organism:Homo sapiens (Human)
Description:ChEMBL_109874
Residue:392
BDBM50173927
NameBDBM50173927
Synonyms:CHEMBL3808902
TypeSmall organic molecule
Emp. Form.C25H24BrN5O2S
Mol. Mass.538.459
SMILESCNC(=O)c1ccc2n([C@@H]3CCC[C@@H](C3)NC(=O)c3ccc(Br)s3)c(nc2c1)-c1ccccn1