Reaction Details
TargetMu-type opioid receptor
LigandBDBM50176259
Substrate/Competitorn/a
Meas. Tech.ChEMBL_1581405 (CHEMBL3812012)
Ki 2400±n/a nM
Citation Shen, QQian, YHuang, XXu, XLi, WLiu, JFu, W Discovery of Potent and Selective Agonists ofd Opioid Receptor by Revisiting the"Message-Address" Concept. ACS Med Chem Lett7:391-6 (2016) 
 
Mu-type opioid receptor
Name:Mu-type opioid receptor
Type:G Protein-Coupled Receptor (GPCR)
Mol. Mass.:44789.51
Organism:Homo sapiens (Human)
Description:P35372
Residue:400
BDBM50176259
NameBDBM50176259
Synonyms:(1R,2R)-2-[(dimethylamino)methyl]-1-(3-methoxyphenyl)cyclohexanol TRAMADOL
TypeSmall organic molecule
Emp. Form.C16H25NO2
Mol. Mass.263.3752
SMILESCOc1cccc(c1)[C@@]1(O)CCCC[C@@H]1CN(C)C