Reaction Details
TargetKappa-type opioid receptor
LigandBDBM50176259
Substrate/Competitorn/a
Meas. Tech.ChEMBL_1581398 (CHEMBL3812005)
Ki>10000±n/a nM
Citation Shen, QQian, YHuang, XXu, XLi, WLiu, JFu, W Discovery of Potent and Selective Agonists ofd Opioid Receptor by Revisiting the"Message-Address" Concept. ACS Med Chem Lett7:391-6 (2016) 
 
Kappa-type opioid receptor
Name:Kappa-type opioid receptor
Type:G Protein-Coupled Receptor (GPCR)
Mol. Mass.:42648.76
Organism:Homo sapiens (Human)
Description:P41145
Residue:380
BDBM50176259
NameBDBM50176259
Synonyms:(1R,2R)-2-[(dimethylamino)methyl]-1-(3-methoxyphenyl)cyclohexanol TRAMADOL
TypeSmall organic molecule
Emp. Form.C16H25NO2
Mol. Mass.263.3752
SMILESCOc1cccc(c1)[C@@]1(O)CCCC[C@@H]1CN(C)C