Reaction Details
TargetDelta-type opioid receptor
LigandBDBM50173995
Substrate/Competitorn/a
Meas. Tech.ChEMBL_1581396 (CHEMBL3812003)
Ki 140±n/a nM
Citation Shen, QQian, YHuang, XXu, XLi, WLiu, JFu, W Discovery of Potent and Selective Agonists ofd Opioid Receptor by Revisiting the"Message-Address" Concept. ACS Med Chem Lett7:391-6 (2016) 
 
Delta-type opioid receptor
Name:Delta-type opioid receptor
Type:G Protein-Coupled Receptor (GPCR)
Mol. Mass.:40382.98
Organism:Homo sapiens (Human)
Description:Competition binding assays were carried out using membrane preparations from transfected HN9.10 cells that constitutively expressed the delta opioid receptor.
Residue:372
BDBM50173995
NameBDBM50173995
Synonyms:CHEMBL3809491
TypeSmall organic molecule
Emp. Form.C26H29NO2
Mol. Mass.387.514
SMILESCN(C)C[C@H]1CCc2cc(ccc2[C@]1(O)c1cccc(O)c1)-c1ccccc1C