Reaction Details
TargetMu-type opioid receptor
LigandBDBM50174101
Substrate/Competitorn/a
Meas. Tech.ChEMBL_1581394 (CHEMBL3812001)
Ki>10000±n/a nM
Citation Shen, QQian, YHuang, XXu, XLi, WLiu, JFu, W Discovery of Potent and Selective Agonists ofd Opioid Receptor by Revisiting the"Message-Address" Concept. ACS Med Chem Lett7:391-6 (2016) 
 
Mu-type opioid receptor
Name:Mu-type opioid receptor
Type:G Protein-Coupled Receptor (GPCR)
Mol. Mass.:44789.51
Organism:Homo sapiens (Human)
Description:P35372
Residue:400
BDBM50174101
NameBDBM50174101
Synonyms:CHEMBL3808589
TypeSmall organic molecule
Emp. Form.C26H29NO3
Mol. Mass.403.5134
SMILESCOc1ccc(cc1)-c1ccc2c(CC[C@H](CN(C)C)[C@@]2(O)c2cccc(O)c2)c1