Reaction Details
TargetMu-type opioid receptor
LigandBDBM50174104
Substrate/Competitorn/a
Meas. Tech.ChEMBL_1581394 (CHEMBL3812001)
Ki>10000±n/a nM
Citation Shen, QQian, YHuang, XXu, XLi, WLiu, JFu, W Discovery of Potent and Selective Agonists ofd Opioid Receptor by Revisiting the"Message-Address" Concept. ACS Med Chem Lett7:391-6 (2016) 
 
Mu-type opioid receptor
Name:Mu-type opioid receptor
Type:G Protein-Coupled Receptor (GPCR)
Mol. Mass.:44789.51
Organism:Homo sapiens (Human)
Description:P35372
Residue:400
BDBM50174104
NameBDBM50174104
Synonyms:CHEMBL3809145
TypeSmall organic molecule
Emp. Form.C27H28F3NO2
Mol. Mass.455.5119
SMILESCOc1cccc(c1)[C@]1(O)[C@@H](CN(C)C)CCc2cc(ccc12)-c1ccc(cc1)C(F)(F)F