Reaction Details
TargetCannabinoid receptor 1
LigandBDBM50318484
Substrate/Competitorn/a
Meas. Tech.ChEMBL_1579326 (CHEMBL3812914)
Ki>10000±n/a nM
Citation Kinney, WAMcDonnell, MEZhong, HMLiu, CYang, LLing, WQian, TChen, YCai, ZPetkanas, DBrenneman, DE Discovery of KLS-13019, a Cannabidiol-Derived Neuroprotective Agent, with Improved Potency, Safety, and Permeability. ACS Med Chem Lett7:424-8 (2016) 
 
Cannabinoid receptor 1
Name:Cannabinoid receptor 1
Type:G Protein-Coupled Receptor (GPCR)
Mol. Mass.:52856.55
Organism:Rattus norvegicus (rat)
Description:P20272
Residue:473
BDBM50318484
NameBDBM50318484
Synonyms:2-((1R,6R)-6-Isopropenyl-3-methyl-cyclohex-2-enyl)-5-pentyl-benzene-1,3-diol CHEMBL190461
TypeSmall organic molecule
Emp. Form.C21H30O2
Mol. Mass.314.4617
SMILESCCCCCc1cc(O)c([C@@H]2C=C(C)CC[C@H]2C(C)=C)c(O)c1