Reaction Details
TargetCannabinoid receptor 1
LigandBDBM50174316
Substrate/Competitorn/a
Meas. Tech.ChEMBL_1579327 (CHEMBL3812915)
Ki 11±n/a nM
Citation Kinney, WAMcDonnell, MEZhong, HMLiu, CYang, LLing, WQian, TChen, YCai, ZPetkanas, DBrenneman, DE Discovery of KLS-13019, a Cannabidiol-Derived Neuroprotective Agent, with Improved Potency, Safety, and Permeability. ACS Med Chem Lett7:424-8 (2016) 
 
Cannabinoid receptor 1
Name:Cannabinoid receptor 1
Type:G Protein-Coupled Receptor (GPCR)
Mol. Mass.:52868.96
Organism:Homo sapiens (Human)
Description:P21554
Residue:472
BDBM50174316
NameBDBM50174316
Synonyms:CHEMBL3809355
TypeSmall organic molecule
Emp. Form.C21H34O2
Mol. Mass.318.4935
SMILESCCCCCCC(C)(C)c1cc(O)c(C2CCCCC2)c(O)c1