Reaction Details
TargetEpidermal growth factor receptor
LigandBDBM4567
Substrate/Competitorn/a
Meas. Tech.ChEMBL_1580544 (CHEMBL3813356)
IC50 36±n/a nM
Citation Tarozzi, AMarchetti, CNicolini, BD'Amico, MTicchi, NPruccoli, LTumiatti, VSimoni, ELodola, AMor, MMilelli, AMinarini, A Combined inhibition of the EGFR/AKT pathways by a novel conjugate of quinazoline with isothiocyanate. Eur J Med Chem117:283-91 (2016) 
 
Epidermal growth factor receptor
Name:Epidermal growth factor receptor
Type:Receptor Kinase Domain
Mol. Mass.:134279.59
Organism:Homo sapiens (Human)
Description:P00533
Residue:1210
BDBM4567
NameBDBM4567
Synonyms:4-anilinoquinazoline deriv. 2 CHEMBL285063 US9422297, PD168393
TypeSmall organic molecule
Emp. Form.C17H13BrN4O
Mol. Mass.369.215
SMILESBrc1cccc(Nc2ncnc3ccc(NC(=O)C=C)cc23)c1