Reaction Details
TargetCarbonic anhydrase 9
LigandBDBM50174418
Substrate/Competitorn/a
Meas. Tech.ChEMBL_1581000 (CHEMBL3812832)
Ki 65±n/a nM
Citation Kumar, SCeruso, MTuccinardi, TSupuran, CTSharma, PK Pyrazolylbenzo[d]imidazoles as new potent and selective inhibitors of carbonic anhydrase isoforms hCA IX and XII. Bioorg Med Chem24:2907-2913 (2016) 
 
Carbonic anhydrase 9
Name:Carbonic anhydrase 9
Type:Enzyme
Mol. Mass.:49669.03
Organism:Homo sapiens (Human)
Description:Catalytic domain of human cloned isozyme was used in the assay
Residue:459
BDBM50174418
NameBDBM50174418
Synonyms:CHEMBL3613524
TypeSmall organic molecule
Emp. Form.C22H15FN4
Mol. Mass.354.3797
SMILESFc1ccc(cc1)-c1nn(cc1-c1nc2ccccc2[nH]1)-c1ccccc1