Reaction Details
TargetCarbonic anhydrase 12
LigandBDBM50174350
Substrate/Competitorn/a
Meas. Tech.ChEMBL_1581001 (CHEMBL3813006)
Ki 7.3±n/a nM
Citation Kumar, SCeruso, MTuccinardi, TSupuran, CTSharma, PK Pyrazolylbenzo[d]imidazoles as new potent and selective inhibitors of carbonic anhydrase isoforms hCA IX and XII. Bioorg Med Chem24:2907-2913 (2016) 
 
Carbonic anhydrase 12
Name:Carbonic anhydrase 12
Type:Enzyme
Mol. Mass.:39456.00
Organism:Homo sapiens (Human)
Description:Catalytic domain of human cloned isozyme was used in the assay
Residue:354
BDBM50174350
NameBDBM50174350
Synonyms:CHEMBL3613514
TypeSmall organic molecule
Emp. Form.C22H16N4
Mol. Mass.336.3892
SMILESc1c(-c2nc3ccccc3[nH]2)c(nn1-c1ccccc1)-c1ccccc1