Reaction Details
TargetCarbonic anhydrase 2
LigandBDBM50174436
Substrate/Competitorn/a
Meas. Tech.ChEMBL_1580999 (CHEMBL3812831)
Ki 4.2±n/a nM
Citation Kumar, SCeruso, MTuccinardi, TSupuran, CTSharma, PK Pyrazolylbenzo[d]imidazoles as new potent and selective inhibitors of carbonic anhydrase isoforms hCA IX and XII. Bioorg Med Chem24:2907-2913 (2016) 
 
Carbonic anhydrase 2
Name:Carbonic anhydrase 2
Type:Enzyme
Mol. Mass.:29250.71
Organism:Homo sapiens (Human)
Description:P00918
Residue:260
BDBM50174436
NameBDBM50174436
Synonyms:CHEMBL3809966
TypeSmall organic molecule
Emp. Form.C23H19N5O3S
Mol. Mass.445.494
SMILESCOc1ccc(cc1)-c1nn(cc1-c1nc2ccccc2[nH]1)-c1ccc(cc1)S(N)(=O)=O