Reaction Details
TargetCarbonic anhydrase 1
LigandBDBM50174426
Substrate/Competitorn/a
Meas. Tech.ChEMBL_1580998 (CHEMBL3812830)
Ki 88±n/a nM
Citation Kumar, SCeruso, MTuccinardi, TSupuran, CTSharma, PK Pyrazolylbenzo[d]imidazoles as new potent and selective inhibitors of carbonic anhydrase isoforms hCA IX and XII. Bioorg Med Chem24:2907-2913 (2016) 
 
Carbonic anhydrase 1
Name:Carbonic anhydrase 1
Type:Enzyme
Mol. Mass.:28873.37
Organism:Homo sapiens (Human)
Description:P00915
Residue:261
BDBM50174426
NameBDBM50174426
Synonyms:CHEMBL3808553
TypeSmall organic molecule
Emp. Form.C22H16ClN5O2S
Mol. Mass.449.913
SMILESNS(=O)(=O)c1ccc(cc1)-n1cc(-c2nc3ccccc3[nH]2)c(n1)-c1ccc(Cl)cc1