Reaction Details
TargetCarbonic anhydrase 9
LigandBDBM50174518
Substrate/Competitorn/a
Meas. Tech.ChEMBL_1581000 (CHEMBL3812832)
Ki 25±n/a nM
Citation Kumar, SCeruso, MTuccinardi, TSupuran, CTSharma, PK Pyrazolylbenzo[d]imidazoles as new potent and selective inhibitors of carbonic anhydrase isoforms hCA IX and XII. Bioorg Med Chem24:2907-2913 (2016) 
 
Carbonic anhydrase 9
Name:Carbonic anhydrase 9
Type:Enzyme
Mol. Mass.:49669.03
Organism:Homo sapiens (Human)
Description:Catalytic domain of human cloned isozyme was used in the assay
Residue:459
BDBM50174518
NameBDBM50174518
Synonyms:CHEMBL3809038
TypeSmall organic molecule
Emp. Form.C22H17N5O2S
Mol. Mass.415.468
SMILESNS(=O)(=O)c1ccc(cc1)-n1cc(-c2nc3ccccc3[nH]2)c(n1)-c1ccccc1