Reaction Details
TargetM-phase inducer phosphatase 1
LigandBDBM50174562
Substrate/Competitorn/a
Meas. Tech.ChEMBL_1580604 (CHEMBL3810612)
Ki 3900±n/a nM
Citation Huber-Villaume, SRevelant, GSibille, EPhilippot, SMorabito, ADunand, SChaimbault, PBagrel, DKirsch, GHesse, SSchohn, H 2-(Thienothiazolylimino)-1,3-thiazolidin-4-ones inhibit cell division cycle 25 A phosphatase. Bioorg Med Chem24:2920-2928 (2016) 
 
M-phase inducer phosphatase 1
Name:M-phase inducer phosphatase 1
Type:Protein
Mol. Mass.:59090.18
Organism:Homo sapiens (Human)
Description:P30304
Residue:524
BDBM50174562
NameBDBM50174562
Synonyms:CHEMBL3809320
TypeSmall organic molecule
Emp. Form.C22H14ClN3O2S3
Mol. Mass.484.013
SMILESCOc1ccc(\C=C2\S\C(NC2=O)=N/c2nc3cc(sc3s2)-c2ccc(Cl)cc2)cc1