Reaction Details
TargetMetallo-beta-lactamase type 2
LigandBDBM50131078
Substrate/Competitorn/a
Meas. Tech.ChEMBL_1581525 (CHEMBL3812667)
Ki 580±n/a nM
Citation Christopeit, TAlbert, ALeiros, HS Discovery of a novel covalent non-ß-lactam inhibitor of the metallo-ß-lactamase NDM-1. Bioorg Med Chem24:2947-2953 (2016) 
 
Metallo-beta-lactamase type 2
Name:Metallo-beta-lactamase type 2
Type:PROTEIN
Mol. Mass.:28498.15
Organism:Klebsiella pneumoniae
Description:ChEMBL_103887
Residue:270
BDBM50131078
NameBDBM50131078
Synonyms:3-formylchromones CHEMBL86905
TypeSmall organic molecule
Emp. Form.C10H6O3
Mol. Mass.174.1528
SMILESO=Cc1coc2ccccc2c1=O