Reaction Details
TargetKappa-type opioid receptor
LigandBDBM50174575
Substrate/Competitorn/a
Meas. Tech.ChEMBL_1579435 (CHEMBL3813455)
Ki 231±n/a nM
Citation Guo, TGan, ZChen, JWang, DHe, LSong, QXu, Y Design, synthesis and biological evaluation of novel tetrahydroisoquinoline quaternary derivatives as peripheral¿-opioid receptor agonists. Bioorg Med Chem24:2964-2970 (2016) 
 
Kappa-type opioid receptor
Name:Kappa-type opioid receptor
Type:G Protein-Coupled Receptor (GPCR)
Mol. Mass.:42648.76
Organism:Homo sapiens (Human)
Description:P41145
Residue:380
BDBM50174575
NameBDBM50174575
Synonyms:CHEMBL3808514
TypeSmall organic molecule
Emp. Form.C25H28ClIN2O3
Mol. Mass.566.859
SMILES[I-].C[N+]1(CC2N(CCc3cc(O)ccc23)C(=O)C2CC(=O)c3ccc(Cl)cc23)CCCC1