Reaction Details
TargetRap guanine nucleotide exchange factor 3
LigandBDBM50011360
Substrate/Competitorn/a
Meas. Tech.ChEMBL_1580633 (CHEMBL3810795)
IC50 10800±n/a nM
Citation Wild, CTZhu, YNa, YMei, FYnalvez, MAChen, HCheng, XZhou, J Functionalized N,N-Diphenylamines as Potent and Selective EPAC2 Inhibitors. ACS Med Chem Lett7:460-4 (2016) 
 
Rap guanine nucleotide exchange factor 3
Name:Rap guanine nucleotide exchange factor 3
Type:PROTEIN
Mol. Mass.:103769.52
Organism:Homo sapiens (Human)
Description:ChEMBL_104531
Residue:923
BDBM50011360
NameBDBM50011360
Synonyms:CHEMBL3260990
TypeSmall organic molecule
Emp. Form.C16H15ClN4O2
Mol. Mass.330.769
SMILESCC(C)(C)c1cc(no1)C(=O)C(=N\Nc1cccc(Cl)c1)\C#N