Reaction Details
TargetRap guanine nucleotide exchange factor 4
LigandBDBM50175266
Substrate/Competitorn/a
Meas. Tech.ChEMBL_1580630 (CHEMBL3810792)
IC50 500±n/a nM
Citation Wild, CTZhu, YNa, YMei, FYnalvez, MAChen, HCheng, XZhou, J Functionalized N,N-Diphenylamines as Potent and Selective EPAC2 Inhibitors. ACS Med Chem Lett7:460-4 (2016) 
 
Rap guanine nucleotide exchange factor 4
Name:Rap guanine nucleotide exchange factor 4
Type:PROTEIN
Mol. Mass.:115526.83
Organism:Homo sapiens (Human)
Description:ChEMBL_1504794
Residue:1011
BDBM50175266
NameBDBM50175266
Synonyms:CHEMBL3808997
TypeSmall organic molecule
Emp. Form.C16H15ClF3N
Mol. Mass.313.745
SMILESCc1cc(C)c(Nc2cc(Cl)cc(c2)C(F)(F)F)c(C)c1