Reaction Details
TargetAurora kinase B
LigandBDBM50175496
Substrate/Competitorn/a
Meas. Tech.ChEMBL_1581135 (CHEMBL3813580)
IC50 50400±n/a nM
Citation An, YLee, EYu, YYun, JLee, MYKang, JSKim, WYJeon, R Design and synthesis of novel benzoxazole analogs as Aurora B kinase inhibitors. Bioorg Med Chem Lett26:3067-72 (2016) 
 
Aurora kinase B
Name:Aurora kinase B
Type:Protein
Mol. Mass.:39327.72
Organism:Homo sapiens (Human)
Description:Q96GD4
Residue:344
BDBM50175496
NameBDBM50175496
Synonyms:CHEMBL3808569
TypeSmall organic molecule
Emp. Form.C27H28ClN5O4
Mol. Mass.521.995
SMILESClc1ccc(NC(=O)Nc2ccc(COc3ccc4nc(NCCN5CCOCC5)oc4c3)cc2)cc1