Reaction Details
TargetSynaptic vesicular amine transporter
LigandBDBM50175678
Substrate/Competitorn/a
Meas. Tech.ChEMBL_1578947 (CHEMBL3810653)
Ki 46±n/a nM
Citation Nickell, JRCulver, JPJanganati, VZheng, GDwoskin, LPCrooks, PA 1,4-Diphenalkylpiperidines: A new scaffold for the design of potent inhibitors of the vesicular monoamine transporter-2. Bioorg Med Chem Lett26:2997-3000 (2016) 
 
Synaptic vesicular amine transporter
Name:Synaptic vesicular amine transporter
Type:Protein
Mol. Mass.:55689.58
Organism:Rattus norvegicus (Rat)
Description:Q01827
Residue:515
BDBM50175678
NameBDBM50175678
Synonyms:CHEMBL3809883
TypeSmall organic molecule
Emp. Form.C22H30ClNO
Mol. Mass.359.933
SMILESCl.COc1ccc(CCN2CCC(CCc3ccccc3)CC2)cc1