Reaction Details
TargetSynaptic vesicular amine transporter
LigandBDBM50175680
Substrate/Competitorn/a
Meas. Tech.ChEMBL_1578947 (CHEMBL3810653)
Ki 32±n/a nM
Citation Nickell, JRCulver, JPJanganati, VZheng, GDwoskin, LPCrooks, PA 1,4-Diphenalkylpiperidines: A new scaffold for the design of potent inhibitors of the vesicular monoamine transporter-2. Bioorg Med Chem Lett26:2997-3000 (2016) 
 
Synaptic vesicular amine transporter
Name:Synaptic vesicular amine transporter
Type:Protein
Mol. Mass.:55689.58
Organism:Rattus norvegicus (Rat)
Description:Q01827
Residue:515
BDBM50175680
NameBDBM50175680
Synonyms:CHEMBL3809460
TypeSmall organic molecule
Emp. Form.C21H27ClFN
Mol. Mass.347.897
SMILESCl.Fc1ccc(CCN2CCC(CCc3ccccc3)CC2)cc1