Reaction Details
TargetSynaptic vesicular amine transporter
LigandBDBM50176137
Substrate/Competitorn/a
Meas. Tech.ChEMBL_1578947 (CHEMBL3810653)
Ki 40±n/a nM
Citation Nickell, JRCulver, JPJanganati, VZheng, GDwoskin, LPCrooks, PA 1,4-Diphenalkylpiperidines: A new scaffold for the design of potent inhibitors of the vesicular monoamine transporter-2. Bioorg Med Chem Lett26:2997-3000 (2016) 
 
Synaptic vesicular amine transporter
Name:Synaptic vesicular amine transporter
Type:Protein
Mol. Mass.:55689.58
Organism:Rattus norvegicus (Rat)
Description:Q01827
Residue:515
BDBM50176137
NameBDBM50176137
Synonyms:CHEMBL3809258
TypeSmall organic molecule
Emp. Form.C22H29Cl2NO
Mol. Mass.394.378
SMILESCl.COc1ccc(CCC2CCN(CCc3ccccc3Cl)CC2)cc1