Reaction Details
TargetOxysterols receptor LXR-beta
LigandBDBM50177012
Substrate/Competitorn/a
Meas. Tech.ChEMBL_1582623 (CHEMBL3817031)
Ki 1.000000±n/a nM
Citation Zheng, YZhuang, LFan, KYTice, CMZhao, WDong, CLotesta, SDLeftheris, KLindblom, PRLiu, ZShimada, JNoto, PBMeng, SHardy, AHoward, LKrosky, PGuo, JLipinski, KKandpal, GBukhtiyarov, YZhao, YLala, DVan Orden, RZhou, JChen, GWu, ZMcKeever, BMMcGeehan, GMGregg, REClaremon, DASingh, SB Discovery of a Novel, Orally Efficacious Liver X Receptor (LXR)ß Agonist. J Med Chem59:3264-71 (2016) 
 
Oxysterols receptor LXR-beta
Name:Oxysterols receptor LXR-beta
Type:Enzyme Catalytic Domain
Mol. Mass.:50978.79
Organism:Homo sapiens (Human)
Description:P55055
Residue:460
BDBM50177012
NameBDBM50177012
Synonyms:CHEMBL3814153 | US10144715, Compound 7-32
TypeSmall organic molecule
Emp. Form.C19H22F4N4O2S
Mol. Mass.446.462
SMILESCC(C)[C@@H]1CN(CCN1c1nccc(n1)C(F)(F)F)c1ccc(F)c(c1)S(C)(=O)=O