Reaction Details
TargetOxysterols receptor LXR-beta
LigandBDBM50177020
Substrate/Competitorn/a
Meas. Tech.ChEMBL_1582625 (CHEMBL3817033)
EC50>20000±n/a nM
Citation Zheng, YZhuang, LFan, KYTice, CMZhao, WDong, CLotesta, SDLeftheris, KLindblom, PRLiu, ZShimada, JNoto, PBMeng, SHardy, AHoward, LKrosky, PGuo, JLipinski, KKandpal, GBukhtiyarov, YZhao, YLala, DVan Orden, RZhou, JChen, GWu, ZMcKeever, BMMcGeehan, GMGregg, REClaremon, DASingh, SB Discovery of a Novel, Orally Efficacious Liver X Receptor (LXR)ß Agonist. J Med Chem59:3264-71 (2016) 
 
Oxysterols receptor LXR-beta
Name:Oxysterols receptor LXR-beta
Type:Enzyme Catalytic Domain
Mol. Mass.:50978.79
Organism:Homo sapiens (Human)
Description:P55055
Residue:460
BDBM50177020
NameBDBM50177020
Synonyms:CHEMBL3815113
TypeSmall organic molecule
Emp. Form.C23H22F3N3
Mol. Mass.397.4361
SMILESFC(F)(F)c1ccc(CN2CCN(CC2c2ccccc2)c2ccccc2)cn1