Reaction Details
TargetHepatocyte growth factor receptor
LigandBDBM50399540
Substrate/Competitorn/a
Meas. Tech.ChEMBL_1581707 (CHEMBL3816040)
IC50 0.400000±n/a nM
Citation Qiang, HGu, WHuang, DShi, WQiu, QDai, YHuang, WQian, H Design, synthesis and biological evaluation of 4-aminopyrimidine-5-cabaldehyde oximes as dual inhibitors of c-Met and VEGFR-2. Bioorg Med Chem24:3353-8 (2016) 
 
Hepatocyte growth factor receptor
Name:Hepatocyte growth factor receptor
Type:Protein
Mol. Mass.:155559.73
Organism:Homo sapiens (Human)
Description:P08581
Residue:1390
BDBM50399540
NameBDBM50399540
Synonyms:FORETINIB US10882853, Compound For-Oxide
TypeSmall organic molecule
Emp. Form.C34H34F2N4O6
Mol. Mass.632.6538
SMILESCOc1cc2c(Oc3ccc(NC(=O)C4(CC4)C(=O)Nc4ccc(F)cc4)cc3F)ccnc2cc1OCCCN1CCOCC1