Reaction Details
TargetPutative P2Y purinoceptor 10
LigandBDBM50177123
Substrate/Competitorn/a
Meas. Tech.ChEMBL_1581711 (CHEMBL3816044)
EC50 45±n/a nM
Citation Jung, SInoue, ANakamura, SKishi, TUwamizu, ASayama, MIkubo, MOtani, YKano, KMakide, KAoki, JOhwada, T Conformational Constraint of the Glycerol Moiety of Lysophosphatidylserine Affords Compounds with Receptor Subtype Selectivity. J Med Chem59:3750-76 (2016) 
 
Putative P2Y purinoceptor 10
Name:Putative P2Y purinoceptor 10
Type:PROTEIN
Mol. Mass.:37264.07
Organism:Mus musculus
Description:ChEMBL_109764
Residue:328
BDBM50177123
NameBDBM50177123
Synonyms:CHEMBL3815090
TypeSmall organic molecule
Emp. Form.C30H44NO9P
Mol. Mass.593.6454
SMILESCCCCCCCCCCCOc1ccccc1CCC(=O)OCc1ccccc1OP(O)(=O)OC[C@H](N)C(O)=O