Reaction Details
TargetMucosa-associated lymphoid tissue lymphoma translocation protein 1
LigandBDBM50177152
Substrate/Competitorn/a
Meas. Tech.ChEMBL_1581725 (CHEMBL3816058)
IC50 6800±n/a nM
Citation Xin, BTSchimmack, GDu, YFlorea, BIvan der Marel, GADriessen, CKrappmann, DOverkleeft, HS Development of new Malt1 inhibitors and probes. Bioorg Med Chem24:3312-29 (2016) 
 
Mucosa-associated lymphoid tissue lymphoma translocation protein 1
Name:Mucosa-associated lymphoid tissue lymphoma translocation protein 1
Type:Enzyme
Mol. Mass.:92257.81
Organism:Homo sapiens (Human)
Description:Q9UDY8
Residue:824
BDBM50177152
NameBDBM50177152
Synonyms:CHEMBL3814162
TypeSmall organic molecule
Emp. Form.C19H18ClFN4O3
Mol. Mass.404.823
SMILESCOCCOc1nc(-c2ccc(F)cc2)n(n1)-c1ccc(NC(=O)CCl)cc1