Reaction Details
TargetMucosa-associated lymphoid tissue lymphoma translocation protein 1
LigandBDBM50177153
Substrate/Competitorn/a
Meas. Tech.ChEMBL_1581725 (CHEMBL3816058)
IC50 1549±n/a nM
Citation Xin, BTSchimmack, GDu, YFlorea, BIvan der Marel, GADriessen, CKrappmann, DOverkleeft, HS Development of new Malt1 inhibitors and probes. Bioorg Med Chem24:3312-29 (2016) 
 
Mucosa-associated lymphoid tissue lymphoma translocation protein 1
Name:Mucosa-associated lymphoid tissue lymphoma translocation protein 1
Type:Enzyme
Mol. Mass.:92257.81
Organism:Homo sapiens (Human)
Description:Q9UDY8
Residue:824
BDBM50177153
NameBDBM50177153
Synonyms:CHEMBL3814576
TypeSmall organic molecule
Emp. Form.C19H18Cl2N4O3
Mol. Mass.421.277
SMILESCOCCOc1nc(-c2ccc(Cl)cc2)n(n1)-c1ccc(NC(=O)CCl)cc1