Reaction Details
TargetSerine/threonine-protein kinase mTOR
LigandBDBM50358204
Substrate/Competitorn/a
Meas. Tech.ChEMBL_1581736 (CHEMBL3816167)
Ki 17±n/a nM
Citation Heffron, TPNdubaku, COSalphati, LAlicke, BCheong, JDrobnick, JEdgar, KGould, SELee, LBLesnick, JDLewis, CNonomiya, JPang, JPlise, EGSideris, SWallin, JWang, LZhang, XOlivero, AG Discovery of Clinical Development Candidate GDC-0084, a Brain Penetrant Inhibitor of PI3K and mTOR. ACS Med Chem Lett7:351-6 (2016) 
 
Serine/threonine-protein kinase mTOR
Name:Serine/threonine-protein kinase mTOR
Type:Rapamycin target protein
Mol. Mass.:288917.12
Organism:Homo sapiens (Human)
Description:P42345
Residue:2549
BDBM50358204
NameBDBM50358204
Synonyms:CHEMBL1922094
TypeSmall organic molecule
Emp. Form.C23H30N8O3S
Mol. Mass.498.601
SMILESC[C@H](O)C(=O)N1CCN(Cc2sc3c(nc(nc3c2C)-c2cnc(N)nc2)N2CCOCC2)CC1