Reaction Details
TargetPhosphatidylinositol 4,5-bisphosphate 3-kinase catalytic subunit alpha isoform
LigandBDBM50177668
Substrate/Competitorn/a
Meas. Tech.ChEMBL_1581735 (CHEMBL3816166)
Ki 3.0±n/a nM
Citation Heffron, TPNdubaku, COSalphati, LAlicke, BCheong, JDrobnick, JEdgar, KGould, SELee, LBLesnick, JDLewis, CNonomiya, JPang, JPlise, EGSideris, SWallin, JWang, LZhang, XOlivero, AG Discovery of Clinical Development Candidate GDC-0084, a Brain Penetrant Inhibitor of PI3K and mTOR. ACS Med Chem Lett7:351-6 (2016) 
 
Phosphatidylinositol 4,5-bisphosphate 3-kinase catalytic subunit alpha isoform
Name:Phosphatidylinositol 4,5-bisphosphate 3-kinase catalytic subunit alpha isoform
Type:Enzyme Subunit
Mol. Mass.:124294.87
Organism:Homo sapiens (Human)
Description:P42336
Residue:1068
BDBM50177668
NameBDBM50177668
Synonyms:CHEMBL3814925
TypeSmall organic molecule
Emp. Form.C17H20N8O3
Mol. Mass.384.3925
SMILESCn1c(nc2c(nc(nc12)-c1cnc(N)nc1)N1CCOCC1)C1(O)COC1