Reaction Details
TargetPhosphatidylinositol 4,5-bisphosphate 3-kinase catalytic subunit alpha isoform
LigandBDBM50398400
Substrate/Competitorn/a
Meas. Tech.ChEMBL_1581735 (CHEMBL3816166)
Ki 1.000000±n/a nM
Citation Heffron, TPNdubaku, COSalphati, LAlicke, BCheong, JDrobnick, JEdgar, KGould, SELee, LBLesnick, JDLewis, CNonomiya, JPang, JPlise, EGSideris, SWallin, JWang, LZhang, XOlivero, AG Discovery of Clinical Development Candidate GDC-0084, a Brain Penetrant Inhibitor of PI3K and mTOR. ACS Med Chem Lett7:351-6 (2016) 
 
Phosphatidylinositol 4,5-bisphosphate 3-kinase catalytic subunit alpha isoform
Name:Phosphatidylinositol 4,5-bisphosphate 3-kinase catalytic subunit alpha isoform
Type:Enzyme Subunit
Mol. Mass.:124294.87
Organism:Homo sapiens (Human)
Description:P42336
Residue:1068
BDBM50398400
NameBDBM50398400
Synonyms:CHEMBL2178606
TypeSmall organic molecule
Emp. Form.C18H22N6O2S
Mol. Mass.386.471
SMILESCOC(C)(C)c1cc2nc(nc(N3CCOCC3)c2s1)-c1cnc(N)nc1