Reaction Details
TargetFatty acid-binding protein, adipocyte
LigandBDBM50177674
Substrate/Competitorn/a
Meas. Tech.ChEMBL_1583389 (CHEMBL3816121)
Ki 100±n/a nM
Citation Tagami, UTakahashi, KIgarashi, SEjima, CYoshida, TTakeshita, SMiyanaga, WSugiki, MTokumasu, MHatanaka, TKashiwagi, TIshikawa, KMiyano, HMizukoshi, T Interaction Analysis of FABP4 Inhibitors by X-ray Crystallography and Fragment Molecular Orbital Analysis. ACS Med Chem Lett7:435-9 (2016) 
 
Fatty acid-binding protein, adipocyte
Name:Fatty acid-binding protein, adipocyte
Type:Enzyme
Mol. Mass.:14719.23
Organism:Homo sapiens (Human)
Description:P15090
Residue:132
BDBM50177674
NameBDBM50177674
Synonyms:CHEMBL3813892
TypeSmall organic molecule
Emp. Form.C26H24N2O3
Mol. Mass.412.4804
SMILESCOc1cnccc1-c1c(-c2ccccc2)n(CCC(O)=O)c2ccc(cc12)C1CC1