Reaction Details
TargetCREB-binding protein
LigandBDBM50178219
Substrate/Competitorn/a
Meas. Tech.ChEMBL_1582080 (CHEMBL3817157)
IC50 30±n/a nM
Citation Taylor, AMCôté, AHewitt, MCPastor, RLeblanc, YNasveschuk, CGRomero, FACrawford, TDCantone, NJayaram, HSetser, JMurray, JBeresini, MHde Leon Boenig, GChen, ZConery, ARCummings, RTDakin, LAFlynn, EMHuang, OWKaufman, SKeller, PJKiefer, JRLai, TLi, YLiao, JLiu, WLu, HPardo, ETsui, VWang, JWang, YXu, ZYan, FYu, DZawadzke, LZhu, XZhu, XSims, RJCochran, AGBellon, SAudia, JEMagnuson, SAlbrecht, BK Fragment-Based Discovery of a Selective and Cell-Active Benzodiazepinone CBP/EP300 Bromodomain Inhibitor (CPI-637). ACS Med Chem Lett7:531-6 (2016) 
 
CREB-binding protein
Name:CREB-binding protein
Type:Transcription Coactivator
Mol. Mass.:265411.66
Organism:Homo sapiens (Human)
Description:Q92793
Residue:2442
BDBM50178219
NameBDBM50178219
Synonyms:CHEMBL3814752
TypeSmall organic molecule
Emp. Form.C22H22N6O
Mol. Mass.386.4497
SMILESC[C@@H]1CC(=O)Nc2cccc(-c3ccc4n(C)nc(-c5cnn(C)c5)c4c3)c2N1