Reaction Details
TargetCREB-binding protein
LigandBDBM50178208
Substrate/Competitorn/a
Meas. Tech.ChEMBL_1582080 (CHEMBL3817157)
IC50>2000000±n/a nM
Citation Taylor, AMCôté, AHewitt, MCPastor, RLeblanc, YNasveschuk, CGRomero, FACrawford, TDCantone, NJayaram, HSetser, JMurray, JBeresini, MHde Leon Boenig, GChen, ZConery, ARCummings, RTDakin, LAFlynn, EMHuang, OWKaufman, SKeller, PJKiefer, JRLai, TLi, YLiao, JLiu, WLu, HPardo, ETsui, VWang, JWang, YXu, ZYan, FYu, DZawadzke, LZhu, XZhu, XSims, RJCochran, AGBellon, SAudia, JEMagnuson, SAlbrecht, BK Fragment-Based Discovery of a Selective and Cell-Active Benzodiazepinone CBP/EP300 Bromodomain Inhibitor (CPI-637). ACS Med Chem Lett7:531-6 (2016) 
 
CREB-binding protein
Name:CREB-binding protein
Type:Transcription Coactivator
Mol. Mass.:265411.66
Organism:Homo sapiens (Human)
Description:Q92793
Residue:2442
BDBM50178208
NameBDBM50178208
Synonyms:CHEMBL3814706 | US10206931, Example 133
TypeSmall organic molecule
Emp. Form.C10H12N2O
Mol. Mass.176.2151
SMILESC[C@H]1CC(=O)Nc2ccccc2N1