Reaction Details
TargetCREB-binding protein
LigandBDBM50178175
Substrate/Competitorn/a
Meas. Tech.ChEMBL_1582084 (CHEMBL3817161)
EC50>10000±n/a nM
Citation Taylor, AMCôté, AHewitt, MCPastor, RLeblanc, YNasveschuk, CGRomero, FACrawford, TDCantone, NJayaram, HSetser, JMurray, JBeresini, MHde Leon Boenig, GChen, ZConery, ARCummings, RTDakin, LAFlynn, EMHuang, OWKaufman, SKeller, PJKiefer, JRLai, TLi, YLiao, JLiu, WLu, HPardo, ETsui, VWang, JWang, YXu, ZYan, FYu, DZawadzke, LZhu, XZhu, XSims, RJCochran, AGBellon, SAudia, JEMagnuson, SAlbrecht, BK Fragment-Based Discovery of a Selective and Cell-Active Benzodiazepinone CBP/EP300 Bromodomain Inhibitor (CPI-637). ACS Med Chem Lett7:531-6 (2016) 
 
CREB-binding protein
Name:CREB-binding protein
Type:Transcription Coactivator
Mol. Mass.:265411.66
Organism:Homo sapiens (Human)
Description:Q92793
Residue:2442
BDBM50178175
NameBDBM50178175
Synonyms:CHEMBL3813915
TypeSmall organic molecule
Emp. Form.C17H20N4O3
Mol. Mass.328.3657
SMILESCC[C@@H](NC(=O)c1cccc2NC(=O)C[C@@H](C)Nc12)c1cnco1