Reaction Details
Target3-phosphoinositide-dependent protein kinase 1
LigandBDBM50178284
Substrate/Competitorn/a
Meas. Tech.ChEMBL_1583663 (CHEMBL3815750)
IC50 120±n/a nM
Citation Wucherer-Plietker, MMerkul, EMüller, TJEsdar, CKnöchel, THeinrich, TBuchstaller, HPGreiner, HDorsch, DFinsinger, DCalderini, MBruge, DGrädler, U Discovery of novel 7-azaindoles as PDK1 inhibitors. Bioorg Med Chem Lett26:3073-80 (2016) 
 
3-phosphoinositide-dependent protein kinase 1
Name:3-phosphoinositide-dependent protein kinase 1
Type:Enzyme
Mol. Mass.:63157.65
Organism:Homo sapiens (Human)
Description:O15530
Residue:556
BDBM50178284
NameBDBM50178284
Synonyms:CHEMBL3814317
TypeSmall organic molecule
Emp. Form.C17H15N5O
Mol. Mass.305.3339
SMILESCCc1cc(nc(N)n1)-c1c[nH]c2ncc(cc12)-c1ccco1