Reaction Details
Target3-phosphoinositide-dependent protein kinase 1
LigandBDBM50178292
Substrate/Competitorn/a
Meas. Tech.ChEMBL_1583663 (CHEMBL3815750)
IC50 110±n/a nM
Citation Wucherer-Plietker, MMerkul, EMüller, TJEsdar, CKnöchel, THeinrich, TBuchstaller, HPGreiner, HDorsch, DFinsinger, DCalderini, MBruge, DGrädler, U Discovery of novel 7-azaindoles as PDK1 inhibitors. Bioorg Med Chem Lett26:3073-80 (2016) 
 
3-phosphoinositide-dependent protein kinase 1
Name:3-phosphoinositide-dependent protein kinase 1
Type:Enzyme
Mol. Mass.:63157.65
Organism:Homo sapiens (Human)
Description:O15530
Residue:556
BDBM50178292
NameBDBM50178292
Synonyms:CHEMBL3813933
TypeSmall organic molecule
Emp. Form.C20H23N7
Mol. Mass.361.4435
SMILESCCc1cc(nc(N)n1)-c1c[nH]c2ncc(cc12)-c1cnn(CC(C)C)c1