Reaction Details
TargetMonocarboxylate transporter 1
LigandBDBM214701
Substrate/Competitorn/a
Meas. Tech.ChEMBL_1581840 (CHEMBL3816459)
IC50 210±n/a nM
Citation Gurrapu, SJonnalagadda, SKAlam, MARonayne, CTNelson, GLSolano, LNLueth, EADrewes, LRMereddy, VR Coumarin carboxylic acids as monocarboxylate transporter 1 inhibitors: In vitro and in vivo studies as potential anticancer agents. Bioorg Med Chem Lett26:3282-3286 (2016) 
 
Monocarboxylate transporter 1
Name:Monocarboxylate transporter 1
Type:Enzyme
Mol. Mass.:53245.17
Organism:Rattus norvegicus (Rat)
Description:P53987
Residue:494
BDBM214701
NameBDBM214701
Synonyms:US9296728, 24
TypeSmall organic molecule
Emp. Form.C16H11NO4
Mol. Mass.281.2628
SMILESOC(=O)c1cc2ccc(cc2oc1=O)N(CC#C)CC#C