Reaction Details
TargetMonocarboxylate transporter 1
LigandBDBM50442702
Substrate/Competitorn/a
Meas. Tech.ChEMBL_1581840 (CHEMBL3816459)
IC50 380±n/a nM
Citation Gurrapu, SJonnalagadda, SKAlam, MARonayne, CTNelson, GLSolano, LNLueth, EADrewes, LRMereddy, VR Coumarin carboxylic acids as monocarboxylate transporter 1 inhibitors: In vitro and in vivo studies as potential anticancer agents. Bioorg Med Chem Lett26:3282-3286 (2016) 
 
Monocarboxylate transporter 1
Name:Monocarboxylate transporter 1
Type:Enzyme
Mol. Mass.:53245.17
Organism:Rattus norvegicus (Rat)
Description:P53987
Residue:494
BDBM50442702
NameBDBM50442702
Synonyms:CHEMBL2442511 | US9296728, 26
TypeSmall organic molecule
Emp. Form.C14H13NO4
Mol. Mass.259.2573
SMILESOC(=O)c1cc2ccc(cc2oc1=O)N1CCCC1