Reaction Details
TargetC-C chemokine receptor type 9
LigandBDBM50178717
Substrate/Competitorn/a
Meas. Tech.ChEMBL_1583874 (CHEMBL3815306)
IC50 93±n/a nM
Citation Pandya, BABaber, CChan, AChamberlain, BChandonnet, HGoss, JHopper, TLippa, BPoutsiaka, KRomero, JStucka, SVaroglu, MZhang, JZhang, X Discovery of indole inhibitors of chemokine receptor 9 (CCR9). Bioorg Med Chem Lett26:3322-3325 (2016) 
 
C-C chemokine receptor type 9
Name:C-C chemokine receptor type 9
Type:PROTEIN
Mol. Mass.:42023.90
Organism:Homo sapiens (Human)
Description:ChEMBL_1510356
Residue:369
BDBM50178717
NameBDBM50178717
Synonyms:CHEMBL3815007
TypeSmall organic molecule
Emp. Form.C20H19N3O2
Mol. Mass.333.3838
SMILESCC(C)(C)c1ccc(Cn2c(cc3ccc(cc23)C#N)C(O)=O)cn1