Reaction Details
TargetC-C chemokine receptor type 9
LigandBDBM50178708
Substrate/Competitorn/a
Meas. Tech.ChEMBL_1583874 (CHEMBL3815306)
IC50 113±n/a nM
Citation Pandya, BABaber, CChan, AChamberlain, BChandonnet, HGoss, JHopper, TLippa, BPoutsiaka, KRomero, JStucka, SVaroglu, MZhang, JZhang, X Discovery of indole inhibitors of chemokine receptor 9 (CCR9). Bioorg Med Chem Lett26:3322-3325 (2016) 
 
C-C chemokine receptor type 9
Name:C-C chemokine receptor type 9
Type:PROTEIN
Mol. Mass.:42023.90
Organism:Homo sapiens (Human)
Description:ChEMBL_1510356
Residue:369
BDBM50178708
NameBDBM50178708
Synonyms:CHEMBL3814251
TypeSmall organic molecule
Emp. Form.C16H10ClF3N2O2
Mol. Mass.354.711
SMILESOC(=O)c1cc2ncc(Cl)cc2n1Cc1ccc(cc1)C(F)(F)F