Reaction Details
TargetRetinoic acid receptor RXR-alpha/alpha
LigandBDBM50178953
Substrate/Competitorn/a
Meas. Tech.ChEMBL_1582203 (CHEMBL3817429)
Ki 1.8±n/a nM
Citation Hughes, NEBleisch, TJJones, SARichardson, TIDoti, RAWang, YStout, SLDurst, GLChambers, MGOskins, JLLin, CAdams, LAPage, TJBarr, RJZink, RWOsborne, HMontrose-Rafizadeh, CNorman, BH Identification of potent and selective retinoic acid receptor gamma (RAR¿) antagonists for the treatment of osteoarthritis pain using structure based drug design. Bioorg Med Chem Lett26:3274-3277 (2016) 
 
Retinoic acid receptor RXR-alpha/alpha
Name:Retinoic acid receptor RXR-alpha/alpha
Synonyms:Retinoic acid receptor alpha/Retinoid X receptor alpha
Type:n/a
Mol. Mass.:n/a
Description:ASSAY_ID of ChEMBL is 1582203
Components:This complex has 2 components.
Component 1
Name:Retinoic acid receptor alpha
Type:PROTEIN
Mol. Mass.:50778.87
Organism:Homo sapiens (Human)
Description:ChEMBL_1466191
Residue:462
Component 2
Name:Retinoic acid receptor RXR-alpha
Synonyms:NR2B1 Nuclear receptor subfamily 4 group A member 2 RXRA Retinoic acid receptor RXR-alpha/gamma Retinoid receptor
Type:PROTEIN
Mol. Mass.:50820.38
Organism:Homo sapiens (Human)
Description:ChEMBL_1456363
Residue:462
BDBM50178953
NameBDBM50178953
Synonyms:CHEMBL3815166
TypeSmall organic molecule
Emp. Form.C27H26N2O4S
Mol. Mass.474.571
SMILESCC(C)(C)c1cccc(c1)-c1cc(nn1-c1ccc(cc1)S(C)(=O)=O)-c1ccc(cc1)C(O)=O