Reaction Details
Target5-hydroxytryptamine receptor 2A
LigandBDBM50178963
Substrate/Competitorn/a
Meas. Tech.ChEMBL_1582550 (CHEMBL3816812)
Ki 165±n/a nM
Citation Kapadia, NAhmed, SHarding, WW New halogenated tris-(phenylalkyl)amines as h5-HT2B receptor ligands. Bioorg Med Chem Lett26:3216-3219 (2016) 
 
5-hydroxytryptamine receptor 2A
Name:5-hydroxytryptamine receptor 2A
Type:undefined
Mol. Mass.:52607.65
Organism:Homo sapiens (Human)
Description:P28223
Residue:471
BDBM50178963
NameBDBM50178963
Synonyms:CHEMBL3735756
TypeSmall organic molecule
Emp. Form.C28H33NO4
Mol. Mass.447.5659
SMILESCOc1ccc(CCN(CCCc2ccccc2)CCc2ccc3OCOc3c2)cc1OC