Reaction Details
Target5-hydroxytryptamine receptor 2C
LigandBDBM50178965
Substrate/Competitorn/a
Meas. Tech.ChEMBL_1582552 (CHEMBL3816814)
Ki 235±n/a nM
Citation Kapadia, NAhmed, SHarding, WW New halogenated tris-(phenylalkyl)amines as h5-HT2B receptor ligands. Bioorg Med Chem Lett26:3216-3219 (2016) 
 
5-hydroxytryptamine receptor 2C
Name:5-hydroxytryptamine receptor 2C
Type:G Protein-Coupled Receptor (GPCR)
Mol. Mass.:51836.79
Organism:Homo sapiens (Human)
Description:P28335
Residue:458
BDBM50178965
NameBDBM50178965
Synonyms:CHEMBL3814708
TypeSmall organic molecule
Emp. Form.C28H32ClNO4
Mol. Mass.482.011
SMILESCOc1ccc(CCN(CCCc2ccc(Cl)cc2)CCc2ccc3OCOc3c2)cc1OC