Reaction Details
TargetEctonucleotide pyrophosphatase/phosphodiesterase family member 1
LigandBDBM50179359
Substrate/Competitorn/a
Meas. Tech.ChEMBL_1583536 (CHEMBL3815623)
Ki 520±n/a nM
Citation Lee, SYPerotti, ADe Jonghe, SHerdewijn, PHanck, TMüller, CE Thiazolo[3,2-a]benzimidazol-3(2H)-one derivatives: Structure-activity relationships of selective nucleotide pyrophosphatase/phosphodiesterase1 (NPP1) inhibitors. Bioorg Med Chem24:3157-65 (2016) 
 
Ectonucleotide pyrophosphatase/phosphodiesterase family member 1
Name:Ectonucleotide pyrophosphatase/phosphodiesterase family member 1
Type:PROTEIN
Mol. Mass.:104934.43
Organism:Homo sapiens (Human)
Description:ChEMBL_1448940
Residue:925
BDBM50179359
NameBDBM50179359
Synonyms:CHEBI:34946 | Reactive Blue 2
TypeSmall organic molecule
Emp. Form.C29H20ClN7O11S3
Mol. Mass.774.157
SMILESNc1c(cc(Nc2ccc(Nc3nc(Cl)nc(Nc4cccc(c4)S(O)(=O)=O)n3)c(c2)S(O)(=O)=O)c2C(=O)c3ccccc3C(=O)c12)S(O)(=O)=O